{"text_format":"1","workbook":"xlsx","n_sheets":7,"sheets":["メニュー表","歓送迎","開店スタンド","お祝い胡蝶蘭","お祝い観葉植物","価格表","Sheet1 (2)"],"not_rendered":{"charts":0,"images":1,"macros":1,"external_links":0,"defined_names":5,"comments":4,"pivot_tables":0},"unopened":[],"bounds":{"document_bytes":16777216,"sheet_cells":100000,"rows_first":2000,"rows_last":500,"rows_between":2000,"halvings":0,"cell_chars":16384,"cell_head_chars":4096},"cells_cut":0,"cells_raw":0,"read":"whole","date_system":"1900"}

{"sheet":"メニュー表","index":0,"n_rows":31,"n_cols":3,"rows_kept":31,"cut":false,"hidden":false,"merged":[[13,2,14,7],[28,2,29,5],[30,2,30,4]]}
[]
[]
[]
[]
[]
[]
[]
[]
[]
[]
[]
[]
[]
[null,null,"ご注文を下記から選んでクリックしてください。"]
[]
[]
[]
[]
[]
[]
[]
[]
[]
[]
[]
[]
[]
[]
[null,null,"お問い合わせはお電話にて承ります"]
[]
[null,null,"TEL052-581-0870"]

{"sheet":"歓送迎","index":1,"n_rows":63,"n_cols":12,"rows_kept":63,"cut":false,"hidden":false,"merged":[[21,0,21,2],[21,3,22,7],[11,3,12,10],[11,0,12,2],[18,0,18,2],[18,3,19,10],[13,3,15,10],[0,0,0,10],[4,0,4,2],[4,3,4,8],[9,0,9,2],[2,8,2,10],[6,0,6,2],[6,3,6,5],[6,6,6,7],[6,8,6,10],[8,7,8,10],[8,0,8,2],[8,3,8,4],[8,5,8,6],[30,9,31,10],[32,1,34,3],[32,4,34,5],[32,6,34,8],[32,9,34,10],[24,0,24,2],[28,0,28,2],[30,1,31,3],[30,4,31,5],[30,6,31,8],[30,0,31,0],[24,8,25,8],[24,4,25,4],[24,6,25,6],[24,3,25,3],[24,5,25,5],[24,7,25,7],[38,1,40,3],[38,4,40,5],[38,6,40,8],[38,9,40,10],[32,0,34,0],[35,0,37,0],[38,0,40,0],[35,1,37,3],[35,4,37,5],[35,6,37,8],[35,9,37,10],[54,11,54,18],[56,3,56,5],[41,0,44,10],[62,1,62,9],[59,6,59,10],[60,6,60,10],[58,6,58,8],[56,0,56,2],[46,0,46,2],[47,1,49,10],[52,1,54,2],[52,3,54,4],[52,5,54,6],[52,7,54,10]]}
["お申込みFAX番号　０５２-５８１-０８７１"]
[]
[null,null,null,null,null,null,null,null,"【ご注文日　　　　　月　　　　　日】"]
[]
["【貴　社　名】",null,null,"                                           　様"]
[]
["【ご担当者】",null,null,null,null,null,"様　【連絡先】"]
[]
["【お渡し方法】",null,null,null,null,null,null,"配達を選んだ方のみお届け先の記入をお願いします"]
["【お 届 け 先】"]
[]
["　　〒"]
[]
[]
[]
[]
[]
[]
["【お 届 け 先 名】"]
[]
[]
["【お 届 け 先 T E L】"]
[]
[]
["【お渡し 希 望 日】",null,null,null,"月",null,"日","（　　　）"]
[]
[]
[]
["【ご 注 文 内 容】"]
[]
["用途","品　　　名",null,null,"数　　量",null,"金　　額（税　抜）",null,null,"摘要欄",null,{"$f":"E33*G33","v":0}]
[]
[null,"お祝い花束（¥5000～）",null,null,null,null,5000]
[null,null,null,null,null,null,null,null,null,null,null,{"$f":"E36*G36","v":0}]
[]
[null,"お祝い花束（¥5000～）",null,null,null,null,5000]
[null,null,null,null,null,null,null,null,null,null,null,{"$f":"E39*G39","v":0}]
[]
[]
[]
[]
["備考欄（スタイル・色合い など）"]
[]
[]
[]
[]
["【お 名 札】"]
[]
[]
[]
[]
[]
[null,"消費税　10％",null,{"$f":"IFERROR(L31*0.1+L34*0.1+L37*0.1,\"\")","v":0},null,"税込合計金額",null,{"$f":"(L31+L34+L37)+D53","v":0}]
[]
[]
[]
["【お支払い方法】"]
[]
[null,null,null,null,null,null,"アルチザンフラワーズ"]
[null,null,null,null,null,null,"〒450-0002　愛知県名古屋市中村区名駅5-5-23"]
[null,null,null,null,null,null,"TEL052-581-0870"]
[null,null,null,null,null,null,"mail : info@artisanflowers.jp"]
[null,"尚、ご不明な点がございましたらご連絡いただきますよう、お願い申し上げます"]

{"sheet":"開店スタンド","index":2,"n_rows":61,"n_cols":12,"rows_kept":61,"cut":false,"hidden":false,"merged":[[36,0,38,0],[30,0,32,0],[33,0,35,0],[30,1,32,3],[30,4,32,5],[30,6,32,8],[30,9,32,10],[36,1,38,3],[36,4,38,5],[36,6,38,8],[36,9,38,10],[10,0,11,2],[10,3,11,10],[12,3,14,10],[16,0,16,2],[16,3,17,10],[19,0,19,2],[33,9,35,10],[28,9,29,10],[33,1,35,3],[33,4,35,5],[33,6,35,8],[19,3,20,7],[22,0,22,2],[22,3,23,3],[26,0,26,2],[28,1,29,3],[28,4,29,5],[28,6,29,8],[22,8,23,8],[28,0,29,0],[22,4,23,4],[0,0,0,10],[4,0,4,2],[4,3,4,8],[8,0,8,2],[2,8,2,10],[6,0,6,2],[6,3,6,5],[6,6,6,7],[6,8,6,10],[22,5,23,5],[22,6,23,6],[22,7,23,7],[60,1,60,9],[44,0,44,2],[45,1,47,10],[50,1,52,2],[50,3,52,4],[50,5,52,6],[50,7,52,10],[54,0,54,2],[56,6,56,8],[57,6,57,10],[58,6,58,10],[54,3,54,5],[39,0,42,10]]}
["お申込みFAX番号　０５２-５８１-０８７１"]
[]
[null,null,null,null,null,null,null,null,"【ご注文日　　　　　月　　　　　日】"]
[]
["【貴　社　名】",null,null,"                                                　様"]
[]
["【ご担当者】",null,null,null,null,null,"様　【連絡先】"]
[]
["【お 届 け 先】"]
[]
["　　〒"]
[]
[]
[]
[]
[]
["【お 届 け 先 名】",null,null,"様"]
[]
[]
["【お 届 け 先 T E L】"]
[]
[]
["【お 届 け 希 望 日】",null,null,null,"月",null,"日","（　　　）"]
[]
[]
[]
["【ご 注 文 内 容】"]
[]
["用途","品　　　名",null,null,"数　　量",null,"金　　額（税　抜）",null,null,"摘要欄"]
[]
[null,null,null,null,null,null,{"$f":"IFERROR(VLOOKUP(B31,価格表!$A$1:$D$4,2,FALSE),\"\")","v":""},null,null,null,null,{"$f":"IFERROR(E31*G31,\"0\")","v":"0"}]
[]
[]
[null,null,null,null,null,null,{"$f":"IFERROR(VLOOKUP(B34,価格表!$A$21:$B$22,2,FALSE),\"\")","v":""},null,null,null,null,{"$f":"IFERROR(E34*G34,\"0\")","v":"0"}]
[]
[]
[null,null,null,null,null,null,{"$f":"IFERROR(VLOOKUP(B37,価格表!$A$21:$B$22,2,FALSE),\"\")","v":""},null,null,null,null,{"$f":"IFERROR(E37*G37,\"0\")","v":"0"}]
[]
[]
["備考欄（スタイル・色合い など）\n33,000円（税込）以下のご注文の場合の配達\n送料：市内（1,100円）市外近郊（2,200円）いただきます。"]
[]
[]
[]
[]
["【お 名 札】"]
[]
[]
[]
[]
[]
[null,"消費税　10％",null,{"$f":"IFERROR((G31+G34+G37)*0.1,\"0\")","v":"0"},null,"税込合計金額",null,{"$f":"IFERROR(G31+G34+G37+D51,\"0\")","v":"0"}]
[]
[]
[]
["【お支払い方法】"]
[]
[null,null,null,null,null,null,"アルチザンフラワーズ"]
[null,null,null,null,null,null,"〒450-0002　愛知県名古屋市中村区名駅5-5-23"]
[null,null,null,null,null,null,"TEL052-581-0870"]
[null,null,null,null,null,null,"mail :  info@artisanflowers.jp"]
[null,"尚、ご不明な点がございましたらご連絡いただきますよう、お願い申し上げます"]

{"sheet":"お祝い胡蝶蘭","index":3,"n_rows":61,"n_cols":12,"rows_kept":61,"cut":false,"hidden":false,"merged":[[30,6,32,8],[30,9,32,10],[28,9,29,10],[33,1,35,3],[33,4,35,5],[33,6,35,8],[33,9,35,10],[30,0,32,0],[33,0,35,0],[36,0,38,0],[30,1,32,3],[30,4,32,5],[36,1,38,3],[36,4,38,5],[22,0,22,2],[26,0,26,2],[28,1,29,3],[28,4,29,5],[28,6,29,8],[22,8,23,8],[22,3,23,3],[22,4,23,4],[22,5,23,5],[22,6,23,6],[22,7,23,7],[28,0,29,0],[10,0,11,2],[10,3,11,10],[0,0,0,10],[4,0,4,2],[4,3,4,8],[8,0,8,2],[6,0,6,2],[6,6,6,7],[6,3,6,5],[6,8,6,10],[2,8,2,10],[12,3,14,10],[16,0,16,2],[16,3,17,10],[19,0,19,2],[19,3,20,7],[36,6,38,8],[36,9,38,10],[60,1,60,9],[44,0,44,2],[45,1,47,10],[50,1,52,2],[50,3,52,4],[50,5,52,6],[50,7,52,10],[54,0,54,2],[56,6,56,8],[57,6,57,10],[58,6,58,10],[54,3,54,5],[39,0,42,10]]}
["お申込みFAX番号　０５２-５８１-０８７１"]
[]
[null,null,null,null,null,null,null,null,"【ご注文日　　　　　月　　　　　日】"]
[]
["【貴　社　名】",null,null,"                                                　様"]
[]
["【ご担当者】",null,null,null,null,null,"様　【連絡先】"]
[]
["【お 届 け 先】"]
[]
["　　〒"]
[]
[]
[]
[]
[]
["【お 届 け 先 名】",null,null,"様"]
[]
[]
["【お 届 け 先 T E L】"]
[]
[]
["【お 届 け 希 望 日】",null,null,null,"月",null,"日","（　　　）"]
[]
[]
[]
["【ご 注 文 内 容】"]
[]
["用途","品　　　名",null,null,"数　　量",null,"金　　額（税　抜）",null,null,"摘要欄"]
[]
[null,null,null,null,null,null,{"$f":"IFERROR(VLOOKUP(お祝い胡蝶蘭!B31,価格表!$A$5:$B$13,2,FALSE),\"\")","v":""},null,null,null,null,{"$f":"E31*G31","v":{"$error":"#VALUE!"}}]
[]
[]
[null,null,null,null,null,null,{"$f":"IFERROR(VLOOKUP(B34,価格表!$A$21:$B$22,2,FALSE),\"\")","v":""},null,null,null,null,{"$f":"E34*G34","v":{"$error":"#VALUE!"}}]
[]
[]
[null,null,null,null,null,null,{"$f":"IFERROR(VLOOKUP(お祝い胡蝶蘭!B37,価格表!$A$5:$B$13,2,FALSE),\"\")","v":""},null,null,null,null,{"$f":"E37*G37","v":{"$error":"#VALUE!"}}]
[]
[]
["備考欄（スタイル・色合い など）\n33,000円（税込）以下のご注文の場合の配達\n送料：市内（1,100円）市外近郊（2,200円）いただきます。"]
[]
[]
[]
[]
["【お 名 札】"]
[]
[]
[]
[]
[]
[null,"消費税　10％",null,{"$f":"IFERROR((G31+G34+G37)*0.1,\"0\")","v":"0"},null,"税込合計金額",null,{"$f":"IFERROR(G31+G34+G37+D51,\"0\")","v":"0"}]
[]
[]
[]
["【お支払い方法】"]
[]
[null,null,null,null,null,null,"アルチザンフラワーズ"]
[null,null,null,null,null,null,"〒450-0002　愛知県名古屋市中村区名駅5-5-23"]
[null,null,null,null,null,null,"TEL052-581-0870"]
[null,null,null,null,null,null,"mail : info@artisanflowers.jp"]
[null,"尚、ご不明な点がございましたらご連絡いただきますよう、お願い申し上げます"]

{"sheet":"お祝い観葉植物","index":4,"n_rows":61,"n_cols":12,"rows_kept":61,"cut":false,"hidden":false,"merged":[[30,6,32,8],[22,3,23,3],[22,4,23,4],[22,5,23,5],[22,6,23,6],[22,7,23,7],[22,8,23,8],[33,0,35,0],[36,0,38,0],[33,1,35,3],[33,4,35,5],[33,6,35,8],[39,0,42,10],[60,1,60,9],[44,0,44,2],[45,1,47,10],[50,1,52,2],[50,3,52,4],[50,5,52,6],[50,7,52,10],[54,0,54,2],[56,6,56,8],[57,6,57,10],[58,6,58,10],[54,3,54,5],[33,9,35,10],[36,1,38,3],[36,4,38,5],[36,6,38,8],[36,9,38,10],[30,9,32,10],[12,3,14,10],[16,0,16,2],[16,3,17,10],[19,0,19,2],[19,3,20,7],[22,0,22,2],[26,0,26,2],[28,1,29,3],[28,4,29,5],[28,6,29,8],[28,9,29,10],[28,0,29,0],[30,0,32,0],[30,1,32,3],[30,4,32,5],[10,0,11,2],[10,3,11,10],[0,0,0,10],[4,0,4,2],[4,3,4,8],[8,0,8,2],[2,8,2,10],[6,0,6,2],[6,3,6,5],[6,6,6,7],[6,8,6,10]]}
["お申込みFAX番号　０５２-５８１-０８７１"]
[]
[null,null,null,null,null,null,null,null,"【ご注文日　　　　　月　　　　　日】"]
[]
["【貴　社　名】",null,null,"                                                　様"]
[]
["【ご担当者】",null,null,null,null,null,"様　【連絡先】"]
[]
["【お 届 け 先】"]
[]
["　　〒"]
[]
[]
[]
[]
[]
["【お 届 け 先 名】",null,null,"様"]
[]
[]
["【お 届 け 先 T E L】"]
[]
[]
["【お 届 け 希 望 日】",null,null,null,"月",null,"日","（　　　）"]
[]
[]
[]
["【ご 注 文 内 容】"]
[]
["用途","品　　　名",null,null,"数　　量",null,"金　　額（税　抜）",null,null,"摘要欄",null,{"$f":"E31*G31","v":{"$error":"#VALUE!"}}]
[]
[null,null,null,null,null,null,{"$f":"IFERROR(VLOOKUP(B31,価格表!$A$14:$B$20,2,FALSE),\"\")","v":""}]
[null,null,null,null,null,null,null,null,null,null,null,{"$f":"E34*G34","v":{"$error":"#VALUE!"}}]
[]
[null,null,null,null,null,null,{"$f":"IFERROR(VLOOKUP(B34,価格表!$A$21:$B$22,2,FALSE),\"\")","v":""}]
[null,null,null,null,null,null,null,null,null,null,null,{"$f":"E37*G37","v":{"$error":"#VALUE!"}}]
[]
[null,null,null,null,null,null,{"$f":"IFERROR(VLOOKUP(B37,価格表!$A$14:$B$20,2,FALSE),\"\")","v":""}]
[]
[]
["備考欄（スタイル・色合い など）\n33,000円（税込）以下のご注文の場合の配達\n送料：市内（1,100円）市外近郊（2,200円）いただきます。"]
[]
[]
[]
[]
["【お 名 札】"]
[]
[]
[]
[]
[]
[null,"消費税　10％",null,{"$f":"IFERROR((G31+G34+G37)*0.1,\"0\")","v":"0"},null,"税込合計金額",null,{"$f":"IFERROR(G31+G34+G37+D51,\"0\")","v":"0"}]
[]
[]
[]
["【お支払い方法】"]
[]
[null,null,null,null,null,null,"アルチザンフラワーズ"]
[null,null,null,null,null,null,"〒450-0002　愛知県名古屋市中村区名駅5-5-23"]
[null,null,null,null,null,null,"TEL052-581-0870"]
[null,null,null,null,null,null,"mail :  info@artisanflowers.jp"]
[null,"尚、ご不明な点がございましたらご連絡いただきますよう、お願い申し上げます"]

{"sheet":"価格表","index":5,"n_rows":31,"n_cols":5,"rows_kept":31,"cut":false,"hidden":false,"merged":[]}
["お祝いスタンド1段",15000]
["お祝いスタンド1段プレミア",20000,null,null,"開店・開業祝い"]
["お祝いスタンド2段",20000,null,null,"周年祝い"]
["お祝いスタンド2段プレミア",30000,null,null,"就任祝い"]
["ミディ胡蝶蘭　アマビリス",10000]
["胡蝶蘭3本立（～21輪）",12000]
["胡蝶蘭3本立（～24輪）",15000]
["胡蝶蘭（ピンク）3本立（～24輪）",15000]
["胡蝶蘭3本立（～30輪）",20000,null,null,"来店"]
["胡蝶蘭3本立（～40輪）",30000,null,null,"配達"]
["胡蝶蘭5本立（～50輪）",40000]
["胡蝶蘭5本立（～65輪）",50000]
["胡蝶蘭5本立（～80輪）",80000]
["ツピタンサス（8号　約100cm～120cm)",17000]
["ユッカ（7号　約80～100cm)",10000]
["ユッカ（10号　約150～180cm)",20000]
["ドラセナコンパクタ(7号　約100cm～120cm)",12000]
["アレカヤシ（8号　約120cm～140 cm)",17000]
["ドラセナ（10号　約180cm)",20000]
["パキラ（10号、約180cm)",20000]
["市内",1000]
["市外近郊",2000]
["AM"]
["PM"]
[null,5000]
[null,6000]
[null,7000]
[null,8000]
[null,9000]
[null,10000]
[null,"１万円以上は摘要欄にご記入ください"]

{"sheet":"Sheet1 (2)","index":6,"n_rows":59,"n_cols":10,"rows_kept":59,"cut":false,"hidden":true,"merged":[[8,0,9,2],[8,3,9,10],[0,0,0,10],[2,0,2,10],[4,0,4,2],[4,3,4,8],[6,0,6,2],[28,1,30,3],[28,4,30,5],[28,6,30,8],[28,9,30,10],[10,3,12,10],[14,0,14,2],[14,3,15,10],[17,0,17,2],[17,3,18,7],[20,0,20,2],[20,3,22,10],[24,0,24,2],[26,1,27,3],[26,4,27,5],[26,6,27,8],[26,9,27,10],[31,1,33,3],[31,4,33,5],[31,6,33,8],[31,9,33,10],[34,1,36,3],[34,4,36,5],[34,6,36,8],[34,9,36,10],[58,1,58,9],[37,1,40,10],[42,0,42,2],[43,1,45,10],[48,1,50,2],[48,3,50,4],[48,5,50,6],[48,7,50,10],[52,0,52,2],[52,3,52,10],[54,6,54,8],[55,6,55,10],[56,6,56,10]]}
["お申込みFAX番号　０５２-４４５-４４１１"]
[]
["【ご注文日　　　　　月　　　　　日】"]
[]
["【貴　社　名】",null,null,"                                                　様"]
[]
["【お 届 け 先】"]
[]
["　　〒"]
[]
[]
[]
[]
[]
["【お 届 け 先 名】",null,null,"様"]
[]
[]
["【お 届 け 先 T E L】"]
[]
[]
["【お 届 け 希 望 日】",null,null,"        　　　　月　　　　　　日　（　　　　　）　　AM　　・　　PM"]
[]
[]
[]
["【ご 注 文 内 容】"]
[]
[null,"品　　　名",null,null,"数　　量",null,"金　　額（税　抜）",null,null,"摘要欄"]
[]
[]
[]
[]
[]
[]
[]
[]
[]
[]
[null,"備考欄（スタイル・色合い など）"]
[]
[]
[]
[]
["【お 名 札】"]
[]
[]
[]
[]
[]
[null,"消費税　10％",null,null,null,"税込合計金額"]
[]
[]
[]
["【お支払い方法】",null,null,"お振込み（月締め）　　　・　　　当日お支払い"]
[]
[null,null,null,null,null,null,"(株)CIFコーポレーション"]
[null,null,null,null,null,null,"〒460-0017　愛知県名古屋市中区松原2丁目9-8"]
[null,null,null,null,null,null,"TEL052-323-1187"]
[]
[null,"尚、ご不明な点がございましたらご連絡いただきますよう、お願い申し上げます"]